{"text_format":"1","workbook":"xlsx","n_sheets":4,"sheets":["1组1阶","工作表1","工作表2","工作表3"],"not_rendered":{"charts":0,"images":6,"macros":1,"external_links":0,"defined_names":0,"comments":0,"pivot_tables":0},"unopened":[],"bounds":{"document_bytes":16777216,"sheet_cells":100000,"rows_first":2000,"rows_last":500,"rows_between":2000,"halvings":0,"cell_chars":16384,"cell_head_chars":4096},"cells_cut":0,"cells_raw":0,"read":"whole","date_system":"1900"}

{"sheet":"1组1阶","index":0,"n_rows":24,"n_cols":37,"rows_kept":24,"cut":false,"hidden":false,"merged":[[0,23,0,24],[2,2,2,13],[2,15,2,20],[2,21,2,23],[2,24,2,25],[0,2,0,6],[0,7,0,8],[0,12,0,13],[0,16,0,17],[3,15,3,17],[3,18,3,20],[3,21,3,22],[3,23,3,24],[3,2,3,5],[3,6,3,7],[3,8,3,10],[3,11,3,13],[4,15,4,17],[4,18,4,20],[4,21,4,22],[4,23,4,24],[4,2,4,5],[4,6,4,7],[4,8,4,10],[4,11,4,13],[5,21,5,22],[5,23,5,24],[5,2,5,5],[5,6,5,7],[5,8,5,10],[5,11,5,13],[7,2,7,4],[7,5,7,6],[7,8,7,10],[7,12,7,13],[5,15,5,17],[5,18,5,20],[8,12,8,13],[9,2,9,4],[9,5,9,6],[9,12,9,13],[8,9,9,9],[8,11,9,11],[15,12,15,13],[15,15,15,17],[15,21,15,22],[19,2,19,10],[19,11,19,15],[16,9,17,9],[11,21,11,23],[12,12,12,13],[13,12,13,13],[15,2,15,4],[15,8,15,10],[19,16,19,17],[19,18,19,25],[12,16,13,16],[16,16,17,16],[16,18,17,18],[12,22,13,22],[15,23,15,24],[12,24,13,24],[11,2,11,4],[11,8,11,10],[11,12,11,13],[11,15,11,17],[12,18,13,18],[16,12,16,13],[17,12,17,13],[20,2,20,4],[20,6,20,7],[20,11,20,12],[20,13,20,15],[20,19,20,20],[20,21,20,22],[23,23,23,24],[20,23,20,24],[21,23,21,24],[22,2,22,4],[22,6,22,7],[22,11,22,12],[22,13,22,15],[22,19,22,20],[22,21,22,22],[22,23,22,24],[21,2,21,4],[21,6,21,7],[21,19,21,20],[21,21,21,22],[21,11,21,12],[21,13,21,15],[27,2,27,4],[27,6,27,7],[27,11,27,12],[27,13,27,15],[27,19,27,20],[27,21,27,22],[27,23,27,24],[28,23,28,24],[23,2,23,4],[23,6,23,7],[23,11,23,12],[23,13,23,15],[23,19,23,20],[23,21,23,22],[29,11,29,12],[29,13,29,15],[29,19,29,20],[29,21,29,22],[29,23,29,24],[28,2,28,4],[28,6,28,7],[28,19,28,20],[28,21,28,22],[28,11,28,12],[28,13,28,15],[33,8,33,25],[12,3,13,3],[16,3,17,3],[12,5,13,5],[16,5,17,5],[12,9,13,9],[12,11,13,11],[16,11,17,11],[30,23,30,24],[31,2,31,4],[31,6,31,7],[31,11,31,12],[31,13,31,15],[31,19,31,20],[31,21,31,22],[31,23,31,24],[30,2,30,4],[30,6,30,7],[30,19,30,20],[30,21,30,22],[30,11,30,12],[30,13,30,15],[29,2,29,4],[29,6,29,7]]}
[null,null,"VBSE项目策略销售",null,null,null,null,"组别：",null,5,null,"公司：","A公司",null,null,"阶段："]
[]
[null,null,"SSO  单一销售目标",null,null,null,null,null,null,null,null,null,null,null,null,"项目态势判断",null,null,null,null,null,"竞争对手："]
[null,null,"客户名称：",null,null,null,"XX大学",null,"已实现收入：",null,null,0,null,null,null,"项目阶段：",null,null,"潜在客户",null,null,"项目申报",null,"项目立项",null,"项目招投标"]
[null,null,"方案内容：",null,null,null,"vbse综合版",null,"本次合同金额：",null,null,190,null,null,null,"客户急迫度："]
[null,null,"本次预计回款：",null,null,null,160,null,"预计成交时间：",null,null,"2015-09-30",null,null,null,"竞争态势："]
[]
[null,null,null,null,null,null,null,null,"郑璇",null,null,"角色","UB"]
[null,null,null,null,null,null,null,null,"反馈","警示","程度","警示","资源"]
[null,null,null,null,null,null,null,null,{"$f":"IF(I22=\"\",\"\",I22)","v":"G"},null,{"$f":"IF(J22=\"\",\"\",J22)","v":"+1"},null,{"$f":"IF(Z22=\"\",\"\",Z22)","v":"业务经理"}]
[]
[null,null,"李院长",null,null,"角色",{"$f":"IF(F23=\"\",\"\",F23)","v":"EB"},null,null,null,null,"角色",{"$f":"IF(F28=\"\",\"\",F28)","v":""},null,null,null,null,null,"角色",{"$f":"IF(F30=\"\",\"\",F30)","v":""},null,null,null,null,"角色",{"$f":"IF(F32=\"\",\"\",F32)","v":""},null,null,null,null,null,null,null,null,null,"分公司总经理","院校拜访"]
[null,null,"反馈","警示","程度","警示","资源",null,"反馈","警示","程度","警示","资源",null,null,"反馈","警示","程度","警示","资源",null,"反馈","警示","程度","警示","资源",null,null,null,null,null,null,null,null,null,"大区总经理","标准方案呈现"]
[null,null,{"$f":"IF(I23=\"\",\"\",I23)","v":"T"},null,{"$f":"IF(J23=\"\",\"\",J23)","v":"+1"},null,{"$f":"IF(Z23=\"\",\"\",Z23)","v":"分公司总经理"},null,{"$f":"IF(I28=\"\",\"\",I28)","v":""},null,{"$f":"IF(J28=\"\",\"\",J28)","v":""},null,{"$f":"IF(Z28=\"\",\"\",Z28)","v":""},null,null,{"$f":"IF(I30=\"\",\"\",I30)","v":""},null,{"$f":"IF(J30=\"\",\"\",J30)","v":""},null,{"$f":"IF(Z30=\"\",\"\",Z30)","v":""},null,{"$f":"IF(I32=\"\",\"\",I32)","v":""},null,{"$f":"IF(J32=\"\",\"\",J32)","v":""},null,{"$f":"IF(Z32=\"\",\"\",Z32)","v":""},null,null,null,null,null,null,null,null,null,"总部顾问","场地规划设计"]
[null,null,null,null,null,null,null,null,null,null,null,null,null,null,null,null,null,null,null,null,null,null,null,null,null,null,null,null,null,null,null,null,null,null,null,"分公司顾问","填写申报书"]
[null,null,"罗老师",null,null,"角色",{"$f":"IF(F24=\"\",\"\",F24)","v":"UB"},null,null,null,null,"角色",{"$f":"IF(F29=\"\",\"\",F29)","v":""},null,null,null,null,null,"角色",{"$f":"IF(F31=\"\",\"\",F31)","v":""},null,"标识",null,"优势",null,"警示",null,null,null,null,null,null,null,null,null,"伙伴总监","项目立项汇报"]
[null,null,"反馈","警示","程度","警示","资源",null,"反馈","警示","程度","警示","资源",null,null,"反馈","警示","程度","警示","资源",null,null,null,null,null,null,null,null,null,null,null,null,null,null,null,"校长联席会","示范中心参观"]
[null,null,{"$f":"IF(I24=\"\",\"\",I24)","v":"EK"},null,{"$f":"IF(J24=\"\",\"\",J24)","v":"-1"},null,{"$f":"IF(Z24=\"\",\"\",Z24)","v":""},null,{"$f":"IF(I29=\"\",\"\",I29)","v":""},null,{"$f":"IF(J29=\"\",\"\",J29)","v":""},null,{"$f":"IF(Z29=\"\",\"\",Z29)","v":""},null,null,{"$f":"IF(I31=\"\",\"\",I31)","v":""},null,{"$f":"IF(J31=\"\",\"\",J31)","v":""},null,{"$f":"IF(Z31=\"\",\"\",Z31)","v":""},null,null,null,null,null,null,null,null,null,null,null,null,null,null,null,"示范中心师资","软件园参观"]
[null,null,null,null,null,null,null,null,null,null,null,null,null,null,null,null,null,null,null,null,null,null,null,null,null,null,null,null,null,null,null,null,null,null,null,"资源中心","校长论坛"]
[null,null,"状态分析",null,null,null,null,null,null,null,null,"角色需求",null,null,null,null,"目标状态",null,"行动计划与资源",null,null,null,null,null,null,null,null,null,null,null,null,null,null,null,null,"公司高管","市场活动"]
[null,null,"姓名及职务",null,null,"角色","最新变化\n（描述）",null,"反馈","程度","现阶段参与度","组织价值\n（描述）",null,"个人价值\n（描述）",null,null,"反馈","程度","是否\n内线","行动\n顺序",null,"行动类型",null,"行动目标\n（描述）",null,"动用资源",null,null,null,null,null,null,null,null,null,"教育专家","商务公关"]
[null,null,"郑璇（系主任）",null,null,"UB",null,null,"G","+1","高",null,null,null,null,null,"G","+4","1","1",null,"场地规划设计",null,null,null,"业务经理",null,null,null,null,null,null,null,null,null,"政府资源","产品演示"]
[null,null,"李院长（经济学院）",null,null,"EB",null,null,"T","+1","中",null,null,null,null,null,"T","+2","0","2",null,"市场活动",null,null,null,"分公司总经理",null,null,null,null,null,null,null,null,null,"业务经理"]
[null,null,"罗老师（系主任）",null,null,"UB",null,null,"EK","-1","低",null,null,null,null,null,"G","+1","0","3",null,null,null,null,null,null,null,null,null,null,null,null,null,null,null,"业务员"]

{"sheet":"工作表1","index":1,"n_rows":0,"n_cols":0,"rows_kept":0,"cut":false,"hidden":false,"merged":[]}

{"sheet":"工作表2","index":2,"n_rows":0,"n_cols":0,"rows_kept":0,"cut":false,"hidden":false,"merged":[]}

{"sheet":"工作表3","index":3,"n_rows":0,"n_cols":0,"rows_kept":0,"cut":false,"hidden":false,"merged":[]}